{"text_format":"1","workbook":"xlsx","n_sheets":4,"sheets":["PLAN DE ACCION","Hoja1","Hoja2","Hoja3"],"not_rendered":{"charts":0,"images":0,"macros":1,"external_links":1,"defined_names":33,"comments":1,"pivot_tables":0},"unopened":[],"bounds":{"document_bytes":16777216,"sheet_cells":100000,"rows_first":2000,"rows_last":500,"rows_between":2000,"halvings":0,"cell_chars":16384,"cell_head_chars":4096},"cells_cut":0,"cells_raw":0,"read":"whole","date_system":"1900"}

{"sheet":"PLAN DE ACCION","index":0,"n_rows":321,"n_cols":24,"rows_kept":321,"cut":false,"hidden":false,"merged":[[34,9,36,9],[39,9,40,9],[43,9,44,9],[13,3,14,3],[13,4,14,4],[15,3,18,3],[15,4,18,4],[23,3,28,3],[23,4,28,4],[34,3,36,3],[20,7,21,7],[23,7,28,7],[52,0,52,1],[34,4,36,4],[39,4,40,4],[43,4,44,4],[20,0,20,1],[17,0,17,1],[18,0,18,1],[19,0,19,1],[24,0,24,1],[48,0,48,1],[320,5,320,8],[10,4,11,4],[10,6,11,6],[10,5,11,5],[318,1,318,3],[319,1,319,3],[320,1,320,3],[23,0,23,1],[49,0,49,1],[34,0,34,1],[117,0,117,1],[113,0,113,1],[94,0,94,1],[95,0,95,1],[114,0,114,1],[115,0,115,1],[135,0,135,1],[118,0,118,1],[119,0,119,1],[120,0,120,1],[121,0,121,1],[122,0,122,1],[129,0,129,1],[130,0,130,1],[319,11,319,23],[318,5,318,8],[13,9,14,9],[15,9,18,9],[23,9,28,9],[54,0,54,1],[55,0,55,1],[21,0,21,1],[31,0,31,1],[319,5,319,8],[13,0,13,1],[72,0,72,1],[103,0,103,1],[104,0,104,1],[76,0,76,1],[78,0,78,1],[79,0,79,1],[89,0,89,1],[90,0,90,1],[91,0,91,1],[86,0,86,1],[105,0,105,1],[106,0,106,1],[116,0,116,1],[10,11,10,22],[5,18,5,22],[10,23,11,23],[10,8,11,8],[318,11,318,23],[22,0,22,1],[25,0,25,1],[50,0,50,1],[33,0,33,1],[53,0,53,1],[77,0,77,1],[60,0,60,1],[61,0,61,1],[62,0,62,1],[63,0,63,1],[75,0,75,1],[87,0,87,1],[88,0,88,1],[80,0,80,1],[81,0,81,1],[82,0,82,1],[83,0,83,1],[84,0,84,1],[85,0,85,1],[320,11,320,23],[5,8,5,17],[7,8,7,22],[5,1,5,4],[27,0,27,1],[28,0,28,1],[32,0,32,1],[30,0,30,1],[11,0,11,1],[51,0,51,1],[40,0,40,1],[41,0,41,1],[57,0,57,1],[35,0,35,1],[36,0,36,1],[37,0,37,1],[38,0,38,1],[39,0,39,1],[42,0,42,1],[43,0,43,1],[44,0,44,1],[45,0,45,1],[46,0,46,1],[47,0,47,1],[0,0,1,23],[2,0,2,23],[3,0,3,23],[10,9,11,9],[10,0,10,2],[10,3,11,3],[64,0,64,1],[73,0,73,1],[74,0,74,1],[56,0,56,1],[58,0,58,1],[59,0,59,1],[69,0,69,1],[70,0,70,1],[71,0,71,1],[14,0,14,1],[15,0,15,1],[29,0,29,1],[16,0,16,1],[26,0,26,1],[65,0,65,1],[66,0,66,1],[67,0,67,1],[68,0,68,1],[133,0,133,1],[134,0,134,1],[154,0,154,1],[155,0,155,1],[156,0,156,1],[157,0,157,1],[158,0,158,1],[92,0,92,1],[96,0,96,1],[97,0,97,1],[112,0,112,1],[93,0,93,1],[153,0,153,1],[136,0,136,1],[137,0,137,1],[138,0,138,1],[139,0,139,1],[140,0,140,1],[141,0,141,1],[142,0,142,1],[151,0,151,1],[152,0,152,1],[312,0,312,1],[107,0,107,1],[108,0,108,1],[109,0,109,1],[110,0,110,1],[111,0,111,1],[131,0,131,1],[132,0,132,1],[145,0,145,1],[146,0,146,1],[147,0,147,1],[148,0,148,1],[149,0,149,1],[150,0,150,1],[125,0,125,1],[126,0,126,1],[143,0,143,1],[144,0,144,1],[127,0,127,1],[128,0,128,1],[177,0,177,1],[178,0,178,1],[159,0,159,1],[160,0,160,1],[313,0,313,1],[98,0,98,1],[99,0,99,1],[100,0,100,1],[101,0,101,1],[102,0,102,1],[123,0,123,1],[124,0,124,1],[170,0,170,1],[172,0,172,1],[173,0,173,1],[174,0,174,1],[175,0,175,1],[176,0,176,1],[171,0,171,1],[164,0,164,1],[165,0,165,1],[166,0,166,1],[167,0,167,1],[168,0,168,1],[169,0,169,1],[187,0,187,1],[188,0,188,1],[189,0,189,1],[161,0,161,1],[162,0,162,1],[179,0,179,1],[180,0,180,1],[163,0,163,1],[195,0,195,1],[196,0,196,1],[197,0,197,1],[198,0,198,1],[181,0,181,1],[182,0,182,1],[183,0,183,1],[184,0,184,1],[185,0,185,1],[186,0,186,1],[190,0,190,1],[191,0,191,1],[192,0,192,1],[193,0,193,1],[194,0,194,1],[204,0,204,1],[205,0,205,1],[206,0,206,1],[208,0,208,1],[215,0,215,1],[216,0,216,1],[199,0,199,1],[200,0,200,1],[201,0,201,1],[202,0,202,1],[203,0,203,1],[211,0,211,1],[212,0,212,1],[213,0,213,1],[214,0,214,1],[207,0,207,1],[209,0,209,1],[210,0,210,1],[217,0,217,1],[218,0,218,1],[219,0,219,1],[220,0,220,1],[221,0,221,1],[222,0,222,1],[223,0,223,1],[224,0,224,1],[225,0,225,1],[226,0,226,1],[227,0,227,1],[228,0,228,1],[229,0,229,1],[230,0,230,1],[240,0,240,1],[241,0,241,1],[242,0,242,1],[244,0,244,1],[231,0,231,1],[232,0,232,1],[233,0,233,1],[234,0,234,1],[259,0,259,1],[260,0,260,1],[261,0,261,1],[251,0,251,1],[252,0,252,1],[235,0,235,1],[236,0,236,1],[237,0,237,1],[238,0,238,1],[239,0,239,1],[253,0,253,1],[254,0,254,1],[255,0,255,1],[256,0,256,1],[257,0,257,1],[258,0,258,1],[247,0,247,1],[248,0,248,1],[249,0,249,1],[250,0,250,1],[243,0,243,1],[245,0,245,1],[246,0,246,1],[271,0,271,1],[272,0,272,1],[273,0,273,1],[274,0,274,1],[275,0,275,1],[276,0,276,1],[277,0,277,1],[278,0,278,1],[280,0,280,1],[262,0,262,1],[263,0,263,1],[264,0,264,1],[265,0,265,1],[266,0,266,1],[267,0,267,1],[268,0,268,1],[269,0,269,1],[270,0,270,1],[290,0,290,1],[287,0,287,1],[288,0,288,1],[281,0,281,1],[282,0,282,1],[283,0,283,1],[284,0,284,1],[285,0,285,1],[279,0,279,1],[23,10,28,10],[308,0,308,1],[309,0,309,1],[310,0,310,1],[311,0,311,1],[303,0,303,1],[304,0,304,1],[305,0,305,1],[306,0,306,1],[291,0,291,1],[292,0,292,1],[293,0,293,1],[294,0,294,1],[295,0,295,1],[296,0,296,1],[286,0,286,1],[307,0,307,1],[297,0,297,1],[298,0,298,1],[299,0,299,1],[300,0,300,1],[301,0,301,1],[302,0,302,1],[289,0,289,1]]}
["UNIVERSIDAD LIBRE"]
[]
["FORMATO PARA ELABORACIÓN DE PRESUPUESTO"]
["P L A N   D E   A C C I Ó N "]
[null,null,null,null,null,"PARA EL AÑO :",2014,null,null,null,null,null,null,null,null,null,null,null,null,null,null,null,null,"V0815:12:05pm"]
["Sede:    ","Pereira (Centro Pereira y Belmonte)",null,null,null,null,"Centro de costos:    ",null,"SGC - Oficina de Sistema de Gestion de C",null,null,null,null,null,null,null,null,null,"Codigo:  ",null,null,null,null,{"$f":"IF(I6=\"\",\"\",VLOOKUP(I6,[1]Tablas!E3:F191,2,FALSE))","v":"91010111"}]
[]
["Código:  ",{"$f":"IF(B6=\"\",\"\",VLOOKUP(B6,SEDES,2,FALSE))","v":"040101"},null,null,null,null,"Unidad ejecutora:   ",null,{"$f":"IF(I6=\"\",\" \",VLOOKUP(LEFT(X6,4),Ud_ACAD,2,FALSE))","v":"Unidades de Apoyo Directivo"}]
[]
[]
["PROYECTO PIDI QUE SE AFECTA",null,null,"METAS","ESTRATEGIA","ACTIVIDADES GENERALES","ACCIONES QUE REQUIEREN PRESUPUESTO",null,"RESPONSABLE","INDICADORES",null,"CRONOGRAMA",null,null,null,null,null,null,null,null,null,null,null,"PRESUPUESTO"]
["NOMBRE",null,"CÓDIGO",null,null,null,null,"Logrado Trim 1-2014",null,null,"% de Cumplimiento","E","F","M","A","M","J","J","A","S","O","N","D"]
[null,null,null,null,null,null,null,null,null,null,null,null,null,null,null,null,null,null,null,null,null,null,null,{"$f":"+SUM(X14:X69)","v":24230000}]
["DISEÑO, IMPLEMENTACIÓN Y SOSTENIMIENTO DE UN SISTEMA DE GESTIÓN DE CALIDAD",null,{"$f":"IF(A14=\"\",\"\",VLOOKUP(A14,PROYECTOS_PIDI,2,FALSE))","v":"02020101"},"Realización de planes de acción por resultados de  auditorías externas  de seguimiento (primera y segunda) ","Ejecución de autorías externas de segumiento","1. Elaborar los planes de acción de los  resultados de la  primera  auditoria ente externo",null,null,{"$f":"IF($I$6<>\"\",IF(A14=0,\" \",CARGO),\"\")","v":"Coordinadora de Calidad"},"Planes de acción elaborados e implementados",null,null,null,null,null,null,"X",null,null,null,null,null,null,0]
["DISEÑO, IMPLEMENTACIÓN Y SOSTENIMIENTO DE UN SISTEMA DE GESTIÓN DE CALIDAD",null,"02020101",null,null,"1. Elaborar los planes de acción de los  resultados de la  segunda auditoria ente externo",null,null,"Coordinadora de Calidad",null,null,null,null,null,null,null,null,null,null,null,null,null,"X",0]
["DISEÑO, IMPLEMENTACIÓN Y SOSTENIMIENTO DE UN SISTEMA DE GESTIÓN DE CALIDAD",null,"02020101","Realizar dos   auditorías internas de calidad durante el año  ","Realización  auditorías internas de calidad ","Evaluación de competencias de los auditores internos de calidad ",null,"Se hizo evaluación de competencias de auditores internos de calidad para el primer ciclo el día 13 de marzo de 2014 en reunión de revisión Gerencial","Coordinadora de Calidad","Auditorías realizadas/ Auditorías programadas",1,null,null,"X",null,null,null,null,null,null,null,null,null,0]
["DISEÑO, IMPLEMENTACIÓN Y SOSTENIMIENTO DE UN SISTEMA DE GESTIÓN DE CALIDAD",null,"02020101",null,null,"Realizar dos   auditorías internas de calidad durante el año : \n• Formulación programas y planes de auditorías\n• Reinducción auditores\n• Selección auditores\n• Asignación de procesos\n• Elaboración listas de chequeo\n• Revisión listas de chequeo\n• Entrega de planes a titulares\n• Desarrollo de las auditorías\n• Entrega de informes\n",null,"Se está preparando la documentación para realizar el primer ciclo de auditorías los días 21, 22 y 23 de mayo de 2014 después de Consejo Directivo","Coordinadora de Calidad",null,0.5,null,null,"X","X",null,null,null,"X","X",null,null,null,0]
["DISEÑO, IMPLEMENTACIÓN Y SOSTENIMIENTO DE UN SISTEMA DE GESTIÓN DE CALIDAD",null,"02020101",null,null,"Elaboración de planes de acción con análisis de causas como resultado de la auditoría interna de calidad ",null,null,"Coordinadora de Calidad",null,null,null,null,null,null,null,"X",null,null,null,"X",null,null,0]
["DISEÑO, IMPLEMENTACIÓN Y SOSTENIMIENTO DE UN SISTEMA DE GESTIÓN DE CALIDAD",null,"02020101",null,null,"Evaluación del equipo auditor por los Titulares de proceso",null,null,"Coordinadora de Calidad",null,null,null,null,null,null,null,"x",null,null,null,null,null,null,0]
["DISEÑO, IMPLEMENTACIÓN Y SOSTENIMIENTO DE UN SISTEMA DE GESTIÓN DE CALIDAD",null,"02020101","Actualizar Mapas de riesgos de 11 procesos  en la herramienta establecidad  en el SGC  y formular las acciones preventivas","Actualización de mapas de riesgos  y  acciones preventivas","Actualizar Mapas de riesgos de 11 procesos  en la herramienta establecidad  en el SGC  y formular las acciones preventivas",null,"Desde la sede principal se está trabajando con los Titulares de proceso sobre la  identificación de nuevos riesgos estándar  a nivel nacional  para ser ajustados en cada Seccional ","Coordinadora de Calidad","No. de Mapas de riesgo actualizados/  total procesos del SGC",null,"X","X","X","X","X","X",null,null,null,null,null,null,0]
["DISEÑO, IMPLEMENTACIÓN Y SOSTENIMIENTO DE UN SISTEMA DE GESTIÓN DE CALIDAD",null,"02020101","Realizar una reunión trimestral  de comité de calidad","Realización de Reuniones de Comité de Calidad","Realizar una reunión trimestral  de comité de calidad","Realizar una reunión trimestral  de comité de calidad","Se realizó la primera reunión de Comité de calidad y revisión Gerenvcial  el día 13 de marzo de 2013","Coordinadora de Calidad","Reuniones realizadas/ Reuniones programadas",{"$f":"1/3","v":0.33333333333333331},null,"X",null,null,"X",null,null,"X",null,null,"X",null,200000]
["DISEÑO, IMPLEMENTACIÓN Y SOSTENIMIENTO DE UN SISTEMA DE GESTIÓN DE CALIDAD",null,"02020101","Realizar una reunión anual   de Revisión Gerencial","Realización de Reunión de Revisión Gerencial","Realizar una reunión anual   de Revisión Gerencial","Realizar una reunión anual   de Revisión Gerencial",null,"Coordinadora de Calidad","Reunión realizada",1,null,null,"X",null,null,null,null,null,null,null,null,null,130000]
["DISEÑO, IMPLEMENTACIÓN Y SOSTENIMIENTO DE UN SISTEMA DE GESTIÓN DE CALIDAD",null,"02020101","Asistir a  una reunión anual de Coordinadores de Calidad en la Sede principal","Reunión Coordinadores de Calidad","Asistir a  una reunión anual de Coordinadores de Calidad en la Sede principal (dos días)","Asistir a  una reunión anual de Coordinadores de Calidad en la Sede principal (dos días)",null,"Coordinadora de Calidad","Asistencia a reunión",null,null,null,null,null,"X",null,null,null,null,null,null,null,1400000]
["DISEÑO, IMPLEMENTACIÓN Y SOSTENIMIENTO DE UN SISTEMA DE GESTIÓN DE CALIDAD",null,"02020101","Solicitar a los 11 procesos la medición  y reporte de indicadores de proceso y de acuerdos de servicio","Medición  y reporte de indicadores","Solicitud a titulares",null,"Se solicitó a los Titulares de proceso la medición de indicadores correspondientes al 2013-2 los cuales hicieron parte de la información de entrada para la revisión gerencial , informe que será enviado a la sede principal a finales del mes de abril de 2014","Coordinadora de Calidad","No. de procesos que reportan resultados de indicadores/ total procesos del SGC",1,"X",null,null,null,null,null,"X",null,null,null,null,null,0]
["DISEÑO, IMPLEMENTACIÓN Y SOSTENIMIENTO DE UN SISTEMA DE GESTIÓN DE CALIDAD",null,"02020101",null,null,"Consolidación de datos",null,null,"Coordinadora de Calidad",null,null,null,"X",null,null,null,null,null,"X",null,null,null,null,0]
["DISEÑO, IMPLEMENTACIÓN Y SOSTENIMIENTO DE UN SISTEMA DE GESTIÓN DE CALIDAD",null,"02020101",null,null,"Revisión de información",null,null,"Coordinadora de Calidad",null,null,null,"X",null,null,null,null,null,"X",null,null,null,null,0]
["DISEÑO, IMPLEMENTACIÓN Y SOSTENIMIENTO DE UN SISTEMA DE GESTIÓN DE CALIDAD",null,"02020101",null,null,"Aclaración de inconsistencias",null,null,"Coordinadora de Calidad",null,null,null,"X",null,null,null,null,null,"X",null,null,null,null,0]
["DISEÑO, IMPLEMENTACIÓN Y SOSTENIMIENTO DE UN SISTEMA DE GESTIÓN DE CALIDAD",null,"02020101",null,null,"Elaboración de reportes",null,null,"Coordinadora de Calidad",null,null,null,"X",null,null,null,null,null,"X",null,null,null,null,0]
["DISEÑO, IMPLEMENTACIÓN Y SOSTENIMIENTO DE UN SISTEMA DE GESTIÓN DE CALIDAD",null,"02020101",null,null,"Envìo Coordinaciòn Nacional",null,null,"Coordinadora de Calidad",null,null,null,null,"X",null,null,null,null,null,"X",null,null,null,0]
["DISEÑO, IMPLEMENTACIÓN Y SOSTENIMIENTO DE UN SISTEMA DE GESTIÓN DE CALIDAD",null,"02020101","Realizar seguimiento al cumplimiento de los PLANES DE MEJORA definidos por los procesos y consolidar informe Seccional","Seguimiento acciones de mejoramiento","Realizar seguimiento al cumplimiento de los PLANES DE MEJORA definidos por los procesos y consolidar informe Seccional",null,"Se hizo seguimiento durante las  auditorías realizadas en el segundo semestre de 2013","Coordinadora de Calidad","No. de procesos que se les realizó  seguimiento  a los planes de mejora/ total procesos del SGC",1,null,null,null,null,null,null,null,null,null,null,null,null,0]
["DISEÑO, IMPLEMENTACIÓN Y SOSTENIMIENTO DE UN SISTEMA DE GESTIÓN DE CALIDAD",null,"02020101","Implementación y puesta en marcha del SGC en los procesos académicos","Implementación y puesta en marcha del SGC en los procesos académicos","Implementación y puesta en marcha del SGC en los procesos académicos","Implementación y puesta en marcha del SGC en los procesos académicos","Ya se tiene un PRE-03-12-2014 donde se menciona la inclusión de procesos académicos al SGC. En la Seccional se tienen 21 procedimientos académicos documentados.","Coordinadora de Calidad","Procesos académicos incluídos en el SGC",null,"X","X","X","X","X","X","X","X","X","X","X","X",0]
["DISEÑO, IMPLEMENTACIÓN Y SOSTENIMIENTO DE UN SISTEMA DE GESTIÓN DE CALIDAD",null,"02020101","Brindar acompañamiento en la estandarización de la documentación de los procesos ","Estandarización de la documentación de los procesos ","Brindar acompañamiento en la estandarización de la documentación de los procesos ",null,"Se brinda acompañamiento permanente a los procesos académicos cada vez que se requiere.","Coordinadora de Calidad","Procesos estandarizados",1,null,null,null,null,null,null,null,null,null,null,null,null,0]
["DISEÑO, IMPLEMENTACIÓN Y SOSTENIMIENTO DE UN SISTEMA DE GESTIÓN DE CALIDAD",null,"02020101","Realizar semanalmente seguimiento y atención a quejas y calificación del servicio","Recolección y atención quejas"," Recolectar las quejas y calificaciones del servivicio depositados en los buzones de sugerencia y tener en cuenta las enviadas por la página Web para que cada titular realice el trámite respectivo dentro de los 15 primeros días hábiles despues de recibida la queja por el Coordinador de Calidad",null,"Se hace seguimiento permanente a la atención a quejas, donde han tenido sobre todo quejas, solicitudes y sugerencias por la Web.","Coordinadora de Calidad","No. de quejas resueltas oportunamente/ Total Quejas presentadas físicamente y por la Web",1,"X","X","X","X","X","X","X","X","X","X","X","X",0]
["DISEÑO, IMPLEMENTACIÓN Y SOSTENIMIENTO DE UN SISTEMA DE GESTIÓN DE CALIDAD",null,"02020101","Elaborar y poner en funcionamiento el  plan de capacitación del SGC  con los siguientes temas: \nNuevos Auditores internos de calidad, \nAcciones correctivas, \nAcciones preventivas, \nAnálisis de causas, etc.\nSector Educativo","Plan de Capacitación ","Elaborar y poner en funcionamiento el  plan de capacitación del SGC  con los siguientes temas: \nNuevos Auditores internos de calidad, \nAcciones correctivas, \nAcciones preventivas, \nAnálisis de causas, etc.\nSector Educativo","Elaborar y poner en funcionamiento el  plan de capacitación del SGC  con los siguientes temas: \nNuevos Auditores internos de calidad, \nAcciones correctivas, \nAcciones preventivas, \nAnálisis de causas, etc.\nSector Educativo","Se realizó el curso de nuevos auditores internos de calidad los días 1, 2 y 3 de abril de 2014","Coordinadora de Calidad","Capacitaciones realizadas/ Capacitaciones programadas",{"$f":"1/5","v":0.2},null,null,null,"x","x","x","x","x","x","x","x","x",2000000]
["DISEÑO, IMPLEMENTACIÓN Y SOSTENIMIENTO DE UN SISTEMA DE GESTIÓN DE CALIDAD",null,"02020101","Realizar encuestas de satisfacción en todos los procesos del sistema de Gestión de Calidad","Realizar encuestas de satisfacción en todos los procesos del sistema de Gestión de Calidad","• Asistencia a reunión con los Coordinadores  de calidad de las seccionales por teleconferencias\n• Recibir capacitación  por parte del Coordinador(a) Nacional",null,"Se han realizado video conferencias programadas por la Sede principal","Coordinadora de Calidad","Resultado y análisis de encuestas",1,null,"X","X","X","X","X","X","X","X","X","X","X",0]
["DISEÑO, IMPLEMENTACIÓN Y SOSTENIMIENTO DE UN SISTEMA DE GESTIÓN DE CALIDAD",null,"02020101",null,null,"2. Aplicación de encuesta  a titulares de proceso y tabulación de datos",null,null,"Coordinadora de Calidad",null,null,null,null,null,null,null,null,null,null,null,"X",null,null,0]
["DISEÑO, IMPLEMENTACIÓN Y SOSTENIMIENTO DE UN SISTEMA DE GESTIÓN DE CALIDAD",null,"02020101",null,null," Envío de datos a la Coordinación nacional de calidad",null,null,"Coordinadora de Calidad",null,null,null,null,null,null,null,null,null,null,null,null,"X",null,0]
["DISEÑO, IMPLEMENTACIÓN Y SOSTENIMIENTO DE UN SISTEMA DE GESTIÓN DE CALIDAD",null,"02020101","Hacer seguimiento a acciones correctivas y preventivas","Seguimiento acciones correctivas y preventivas","Hacer seguimiento acciones correctivas y preventivas",null,null,"Coordinadora de Calidad","Seguimientos realizados",null,null,"X","X",null,null,null,null,null,null,null,"X","X",0]
["DISEÑO, IMPLEMENTACIÓN Y SOSTENIMIENTO DE UN SISTEMA DE GESTIÓN DE CALIDAD",null,"02020101","Solicitar la compra de 200 formatos de Quejas y reclamos que se ubican en los buzones de sugerencia  a razón $400 la unidad - 15 afiches  para temas de calidad","Solicitar la compra de 200 formatos de Quejas y reclamos que se ubican en los buzones de sugerencia  a razón $400 la unidad - 15 afiches de objetivos y política de calidad","Solicitar la elaboración  de 200  formato de Quejas, 3000 formatos de calificación del servicio y 15 afiches de objetivos y política de calidad","Solicitar la elaboración  de 200  formato de Quejas, 3000 formatos de calificación del servicio y 15 afiches de objetivos y política de calidad",null,"Coordinadora de Calidad","Formatos adquiridos  y afiches elaborados",null,null,null,null,null,null,"X",null,null,null,null,null,null,600000]
["DISEÑO, IMPLEMENTACIÓN Y SOSTENIMIENTO DE UN SISTEMA DE GESTIÓN DE CALIDAD",null,"02020101","Apoyar presupuestalmente a la sede principal para adquisición de software de calidad","Software de calidad y de riesgo","Apoyar presupuestalmente a la sede principal para adquisición de software de calidad","Apoyar presupuestalmente a la sede principal para adquisición de software de calidad",null,"Coordinadora de Calidad","Compra realizada a través de la sede principal",null,null,null,null,null,null,null,null,null,null,null,null,null,9000000]
["DISEÑO, IMPLEMENTACIÓN Y SOSTENIMIENTO DE UN SISTEMA DE GESTIÓN DE CALIDAD",null,"02020101","Aportar proporcionalmente al Software de riesgo ",null,"Aportar proporcionalmente al Software de riesgo ","Aportar proporcionalmente al Software de riesgo ",null,"Coordinadora de Calidad",null,null,null,null,null,null,null,null,null,null,null,null,null,null,1500000]
["DISEÑO, IMPLEMENTACIÓN Y SOSTENIMIENTO DE UN SISTEMA DE GESTIÓN DE CALIDAD",null,"02020101","Aporte seccional para Publicidad de la Revista CALIBRE: Edición semestral","Revista Calibre","Aporte seccional para Publicidad de la Revista CALIBRE: Edición semestral: \nImpresión de 1.400 (200 por sede)  boletínes que elaboran las diferentes seccionales de acuerdo a cronograma","Aporte seccional para Publicidad de la Revista CALIBRE: Edición semestral: \nImpresión de 1.400 (200 por sede)  boletínes que elaboran las diferentes seccionales de acuerdo a cronograma",null,"Coordinadora de Calidad","Revista elaborada y socializada",null,null,null,null,null,null,null,null,null,null,null,null,null,1000000]
["DISEÑO, IMPLEMENTACIÓN Y SOSTENIMIENTO DE UN SISTEMA DE GESTIÓN DE CALIDAD",null,"02020101","Brindar incentivos al  equipo auditor y personal involucrado en el SGC","Brindar incentivos al  equipo auditor y personal involucrado en el SGC","Brindar incentivos al  equipo auditor y personal involucrado en el SGC","Brindar incentivos al  equipo auditor y personal involucrado en el SGC",null,"Coordinadora de Calidad","Incentivos brindados",null,null,null,null,null,null,null,null,null,null,null,null,null,1000000]
["DISEÑO, IMPLEMENTACIÓN Y SOSTENIMIENTO DE UN SISTEMA DE GESTIÓN DE CALIDAD",null,"02020101","Atención a visita del Coordinador de calidad","Atención a visitas","Atención a visita del Coordinador de calidad (Viáticos y transporte)","Atención a visita del Coordinador de calidad (Viáticos y transporte)",null,"Coordinadora de Calidad","Visitas realizadas y atendidas",null,null,null,null,null,null,null,null,null,null,null,null,null,1600000]
["DISEÑO, IMPLEMENTACIÓN Y SOSTENIMIENTO DE UN SISTEMA DE GESTIÓN DE CALIDAD",null,"02020101","1. Visitas a las Seccionales para recibir y trasladar auditores internos  seccionales:  Viáticos y pasajes aéreos. \n\n",null,"Atención a Visitas a las Seccionales para recibir y trasladar auditores internos  seccionales: 1 viaje  por tres días de 1 auditor de  otra eccional (Viáticos, y pasajes aéreos) ","Atención a Visitas a las Seccionales para recibir y trasladar auditores internos  seccionales: 1 viaje  por tres días de 2 auditores de  otra eccional (Viáticos, y pasajes aéreos) ",null,"Coordinadora de Calidad",null,null,null,null,null,null,null,null,null,null,null,null,null,null,5500000]
["DISEÑO, IMPLEMENTACIÓN Y SOSTENIMIENTO DE UN SISTEMA DE GESTIÓN DE CALIDAD",null,"02020101","Solicitar la compra y reposición de  5  buzones de sugerencias","Solicitar la compra y reposición de  buzones de sugerencia (5) a razón de $60.0000","Solicitar la compra y reposición de  buzones de sugerencia (5) a razón de $60.0000","Solicitar la compra y reposición de  buzones de sugerencia (5) a razón de $60.0000",null,"Coordinadora de Calidad","Compra realizada",null,null,null,null,null,null,"X",null,null,null,null,null,null,300000]
[null,null,"",null,null,null,null,null," ",null,null,null,null,null,null,null,null,null,null,null,null,null,null,0]
[null,null,"",null,null,null,null,null," ",null,null,null,null,null,null,null,null,null,null,null,null,null,null,0]
[null,null,"",null,null,null,null,null," ",null,null,null,null,null,null,null,null,null,null,null,null,null,null,0]
[null,null,"",null,null,null,null,null," ",null,null,null,null,null,null,null,null,null,null,null,null,null,null,0]
[null,null,"",null,null,null,null,null," ",null,null,null,null,null,null,null,null,null,null,null,null,null,null,0]
[null,null,"",null,null,null,null,null," ",null,null,null,null,null,null,null,null,null,null,null,null,null,null,0]
[null,null,"",null,null,null,null,null," ",null,null,null,null,null,null,null,null,null,null,null,null,null,null,0]
[null,null,"",null,null,null,null,null," ",null,null,null,null,null,null,null,null,null,null,null,null,null,null,0]
[null,null,"",null,null,null,null,null," ",null,null,null,null,null,null,null,null,null,null,null,null,null,null,0]
[null,null,"",null,null,null,null,null," ",null,null,null,null,null,null,null,null,null,null,null,null,null,null,0]
[null,null,"",null,null,null,null,null," ",null,null,null,null,null,null,null,null,null,null,null,null,null,null,0]
[null,null,"",null,null,null,null,null," ",null,null,null,null,null,null,null,null,null,null,null,null,null,null,0]
[null,null,"",null,null,null,null,null," ",null,null,null,null,null,null,null,null,null,null,null,null,null,null,0]
[null,null,"",null,null,null,null,null," ",null,null,null,null,null,null,null,null,null,null,null,null,null,null,0]
{"$rows_left_out":262}
{"sheet":"Hoja1","index":1,"n_rows":0,"n_cols":0,"rows_kept":0,"cut":false,"hidden":false,"merged":[]}

{"sheet":"Hoja2","index":2,"n_rows":0,"n_cols":0,"rows_kept":0,"cut":false,"hidden":false,"merged":[]}

{"sheet":"Hoja3","index":3,"n_rows":0,"n_cols":0,"rows_kept":0,"cut":false,"hidden":false,"merged":[]}